------------------------------
Building Makefile for Inkscape
------------------------------
Source Dir: /var/pisi/inkscape-1.4.3-25/work/inkscape-1.4.3_2025-12-25_0d15f75042
Binary Dir: /var/pisi/inkscape-1.4.3-25/work/inkscape-1.4.3_2025-12-25_0d15f75042/_build
INFO: Reading /var/pisi/inkscape-1.4.3-25/work/inkscape-1.4.3_2025-12-25_0d15f75042/src/helper/sp-marshal.list...
INFO: Reading /var/pisi/inkscape-1.4.3-25/work/inkscape-1.4.3_2025-12-25_0d15f75042/src/helper/sp-marshal.list...
CMake Warning (deprecated) at src/3rdparty/libcroco/CMakeLists.txt:1 (cmake_minimum_required):
  Compatibility with CMake < 3.10 will be removed from a future version of
  CMake.

  Update the VERSION argument  value.  Or, use the ... syntax
  to tell CMake that the project requires at least  but has been updated
  to work with policies introduced by  or earlier.
This warning is for project developers.  Use -Wno-author or -Wno-deprecated
to suppress it.

CMake Warning (policy) at src/3rdparty/2geom/CMakeLists.txt:34 (find_package):
  Policy CMP0167 is not set: The FindBoost module is removed.  Run "cmake
  --help-policy CMP0167" for policy details.  Use the cmake_policy command to
  set the policy and suppress this warning.
This warning is for project developers.  Use -Wno-author or -Wno-policy to
suppress it.

CMake Warning (policy) at src/3rdparty/2geom/src/performance-tests/CMakeLists.txt:20 (add_custom_command):
  Exactly one of PRE_BUILD, PRE_LINK, or POST_BUILD must be given.  Assuming
  POST_BUILD to preserve backward compatibility.

  Policy CMP0175 is not set: add_custom_command() rejects invalid arguments.
  Run "cmake --help-policy CMP0175" for policy details.  Use the cmake_policy
  command to set the policy and suppress this warning.
This warning is for project developers.  Use -Wno-author or -Wno-policy to
suppress it.

CMake Warning (policy) at src/3rdparty/2geom/src/performance-tests/CMakeLists.txt:20 (add_custom_command):
  Exactly one of PRE_BUILD, PRE_LINK, or POST_BUILD must be given.  Assuming
  POST_BUILD to preserve backward compatibility.

  Policy CMP0175 is not set: add_custom_command() rejects invalid arguments.
  Run "cmake --help-policy CMP0175" for policy details.  Use the cmake_policy
  command to set the policy and suppress this warning.
This warning is for project developers.  Use -Wno-author or -Wno-policy to
suppress it.

CMake Warning (policy) at src/3rdparty/2geom/src/performance-tests/CMakeLists.txt:20 (add_custom_command):
  Exactly one of PRE_BUILD, PRE_LINK, or POST_BUILD must be given.  Assuming
  POST_BUILD to preserve backward compatibility.

  Policy CMP0175 is not set: add_custom_command() rejects invalid arguments.
  Run "cmake --help-policy CMP0175" for policy details.  Use the cmake_policy
  command to set the policy and suppress this warning.
This warning is for project developers.  Use -Wno-author or -Wno-policy to
suppress it.

CMake Warning (policy) at src/3rdparty/2geom/src/performance-tests/CMakeLists.txt:20 (add_custom_command):
  Exactly one of PRE_BUILD, PRE_LINK, or POST_BUILD must be given.  Assuming
  POST_BUILD to preserve backward compatibility.

  Policy CMP0175 is not set: add_custom_command() rejects invalid arguments.
  Run "cmake --help-policy CMP0175" for policy details.  Use the cmake_policy
  command to set the policy and suppress this warning.
This warning is for project developers.  Use -Wno-author or -Wno-policy to
suppress it.

CMake Warning (policy) at src/3rdparty/2geom/src/performance-tests/CMakeLists.txt:20 (add_custom_command):
  Exactly one of PRE_BUILD, PRE_LINK, or POST_BUILD must be given.  Assuming
  POST_BUILD to preserve backward compatibility.

  Policy CMP0175 is not set: add_custom_command() rejects invalid arguments.
  Run "cmake --help-policy CMP0175" for policy details.  Use the cmake_policy
  command to set the policy and suppress this warning.
This warning is for project developers.  Use -Wno-author or -Wno-policy to
suppress it.

CMake Warning (policy) at src/3rdparty/2geom/src/performance-tests/CMakeLists.txt:20 (add_custom_command):
  Exactly one of PRE_BUILD, PRE_LINK, or POST_BUILD must be given.  Assuming
  POST_BUILD to preserve backward compatibility.

  Policy CMP0175 is not set: add_custom_command() rejects invalid arguments.
  Run "cmake --help-policy CMP0175" for policy details.  Use the cmake_policy
  command to set the policy and suppress this warning.
This warning is for project developers.  Use -Wno-author or -Wno-policy to
suppress it.

INKSCAPE_DIST_PREFIX: inkscape-1.4.3
------------------------------------------------------------------------
Configuration Summary
------------------------------------------------------------------------
PROJECT_NAME:            inkscape
INKSCAPE_VERSION:        1.4.3
INKSCAPE_DIST_PREFIX:    inkscape-1.4.3

CMAKE_BINARY_DIR:        /var/pisi/inkscape-1.4.3-25/work/inkscape-1.4.3_2025-12-25_0d15f75042/_build
CMAKE_INSTALL_PREFIX:    /usr
CMAKE_INSTALL_LIBDIR:    lib
PACKAGE_LOCALE_DIR       share/locale
CMAKE_SYSTEM_NAME:       Linux
CMAKE_SYSTEM_VERSION:    6.18.43
CMAKE_SYSTEM_PROCESSOR:  x86_64
CMAKE_C_COMPILER:        /usr/bin/x86_64-pc-linux-gnu-gcc
CMAKE_CXX_COMPILER:      /usr/bin/x86_64-pc-linux-gnu-g++
CMAKE_BUILD_TYPE:        None

ENABLE_LCMS:             ON
ENABLE_POPPLER:          ON
ENABLE_POPPLER_CAIRO:    ON
WITH_GNU_READLINE:       ON
WITH_GSPELL:             OFF
WITH_GSOURCEVIEW:        ON
WITH_IMAGE_MAGICK:       OFF
WITH_GRAPHICS_MAGICK:    ON
WITH_LIBCDR:             ON
WITH_LIBVISIO:           ON
WITH_LIBWPG:             ON
WITH_NLS:                ON
WITH_OPENMP:             ON
WITH_JEMALLOC:           OFF
WITH_ASAN:               OFF
WITH_INTERNAL_2GEOM:     ON
WITH_X11:                ON
WITH_PROFILING:          OFF
BUILD_TESTING:           OFF
------------------------------------------------------------------------
CMake Warning (unused-cli):
  Manually-specified variables were not used by the project:

    2GEOM_PERFOMANCE_TESTS
    BUILD_STATIC_LIBS
    CMAKE_LD_FLAGS
    WITH_DBUS
    WITH_INTERNAL_CAIRO


In file included from /var/pisi/inkscape-1.4.3-25/work/inkscape-1.4.3_2025-12-25_0d15f75042/src/util/font-discovery.h:10,
                 from /var/pisi/inkscape-1.4.3-25/work/inkscape-1.4.3_2025-12-25_0d15f75042/src/util/font-discovery.cpp:3:
/var/pisi/inkscape-1.4.3-25/work/inkscape-1.4.3_2025-12-25_0d15f75042/src/async/operation-stream.h: In lambda function:
/var/pisi/inkscape-1.4.3-25/work/inkscape-1.4.3_2025-12-25_0d15f75042/src/async/operation-stream.h:81:30: warning: implicit capture of ‘this’ via ‘[=]’ is deprecated in C++20 [-Wdeprecated]
   81 |             .on_started    = [=]() { emit(Msg::OperationStarted {}); },
      |                              ^
/var/pisi/inkscape-1.4.3-25/work/inkscape-1.4.3_2025-12-25_0d15f75042/src/async/operation-stream.h:81:30: note: add explicit ‘this’ or ‘*this’ capture
/var/pisi/inkscape-1.4.3-25/work/inkscape-1.4.3_2025-12-25_0d15f75042/src/async/operation-stream.h: In lambda function:
/var/pisi/inkscape-1.4.3-25/work/inkscape-1.4.3_2025-12-25_0d15f75042/src/async/operation-stream.h:82:30: warning: implicit capture of ‘this’ via ‘[=]’ is deprecated in C++20 [-Wdeprecated]
   82 |             .on_progress   = [=](T... p) { emit(Msg::OperationProgress {std::tuple(p...)}); },
      |                              ^
/var/pisi/inkscape-1.4.3-25/work/inkscape-1.4.3_2025-12-25_0d15f75042/src/async/operation-stream.h:82:30: note: add explicit ‘this’ or ‘*this’ capture
/var/pisi/inkscape-1.4.3-25/work/inkscape-1.4.3_2025-12-25_0d15f75042/src/async/operation-stream.h: In lambda function:
/var/pisi/inkscape-1.4.3-25/work/inkscape-1.4.3_2025-12-25_0d15f75042/src/async/operation-stream.h:84:30: warning: implicit capture of ‘this’ via ‘[=]’ is deprecated in C++20 [-Wdeprecated]
   84 |             .on_complete   = [=](R result) { emit(Msg::OperationResult {result = std::move(result)}); },
      |                              ^
/var/pisi/inkscape-1.4.3-25/work/inkscape-1.4.3_2025-12-25_0d15f75042/src/async/operation-stream.h:84:30: note: add explicit ‘this’ or ‘*this’ capture
/var/pisi/inkscape-1.4.3-25/work/inkscape-1.4.3_2025-12-25_0d15f75042/src/async/operation-stream.h: In lambda function:
/var/pisi/inkscape-1.4.3-25/work/inkscape-1.4.3_2025-12-25_0d15f75042/src/async/operation-stream.h:85:30: warning: implicit capture of ‘this’ via ‘[=]’ is deprecated in C++20 [-Wdeprecated]
   85 |             .on_cancelled  = [=]() { emit(Msg::OperationCancelled {}); },
      |                              ^
/var/pisi/inkscape-1.4.3-25/work/inkscape-1.4.3_2025-12-25_0d15f75042/src/async/operation-stream.h:85:30: note: add explicit ‘this’ or ‘*this’ capture
/var/pisi/inkscape-1.4.3-25/work/inkscape-1.4.3_2025-12-25_0d15f75042/src/async/operation-stream.h: In lambda function:
/var/pisi/inkscape-1.4.3-25/work/inkscape-1.4.3_2025-12-25_0d15f75042/src/async/operation-stream.h:86:30: warning: implicit capture of ‘this’ via ‘[=]’ is deprecated in C++20 [-Wdeprecated]
   86 |             .on_exception  = [=](std::exception_ptr ex) { emit(Msg::OperationException {ex}); },
      |                              ^
/var/pisi/inkscape-1.4.3-25/work/inkscape-1.4.3_2025-12-25_0d15f75042/src/async/operation-stream.h:86:30: note: add explicit ‘this’ or ‘*this’ capture
/var/pisi/inkscape-1.4.3-25/work/inkscape-1.4.3_2025-12-25_0d15f75042/src/async/operation-stream.h: In lambda function:
/var/pisi/inkscape-1.4.3-25/work/inkscape-1.4.3_2025-12-25_0d15f75042/src/async/operation-stream.h:87:30: warning: implicit capture of ‘this’ via ‘[=]’ is deprecated in C++20 [-Wdeprecated]
   87 |             .on_finished   = [=]() { emit(Msg::OperationFinished {}); },
      |                              ^
/var/pisi/inkscape-1.4.3-25/work/inkscape-1.4.3_2025-12-25_0d15f75042/src/async/operation-stream.h:87:30: note: add explicit ‘this’ or ‘*this’ capture
/var/pisi/inkscape-1.4.3-25/work/inkscape-1.4.3_2025-12-25_0d15f75042/src/util/font-discovery.cpp: In lambda function:
/var/pisi/inkscape-1.4.3-25/work/inkscape-1.4.3_2025-12-25_0d15f75042/src/util/font-discovery.cpp:421:49: warning: implicit capture of ‘this’ via ‘[=]’ is deprecated in C++20 [-Wdeprecated]
  421 |         i->gio_app()->signal_shutdown().connect([=](){
      |                                                 ^
/var/pisi/inkscape-1.4.3-25/work/inkscape-1.4.3_2025-12-25_0d15f75042/src/util/font-discovery.cpp:421:49: note: add explicit ‘this’ or ‘*this’ capture
/var/pisi/inkscape-1.4.3-25/work/inkscape-1.4.3_2025-12-25_0d15f75042/src/util/font-discovery.cpp: In lambda function:
/var/pisi/inkscape-1.4.3-25/work/inkscape-1.4.3_2025-12-25_0d15f75042/src/util/font-discovery.cpp:426:38: warning: implicit capture of ‘this’ via ‘[=]’ is deprecated in C++20 [-Wdeprecated]
  426 |     _connection = _loading.subscribe([=](const MessageType& msg) {
      |                                      ^
/var/pisi/inkscape-1.4.3-25/work/inkscape-1.4.3_2025-12-25_0d15f75042/src/util/font-discovery.cpp:426:38: note: add explicit ‘this’ or ‘*this’ capture
revision is 0d15f75042, 2025-12-25
/var/pisi/inkscape-1.4.3-25/work/inkscape-1.4.3_2025-12-25_0d15f75042/src/extension/internal/pdfinput/poppler-utils.cpp: In member function ‘void InkFontDict::hashFontObject1(const Object*, FNVHash*)’:
/var/pisi/inkscape-1.4.3-25/work/inkscape-1.4.3_2025-12-25_0d15f75042/src/extension/internal/pdfinput/poppler-utils.cpp:199:43: error: ‘const class Object’ has no member named ‘arrayGetNF’; did you mean ‘arrayGet’?
  199 |                 const Object &obj2 = obj->arrayGetNF(i);
      |                                           ^~~~~~~~~~
      |                                           arrayGet
/var/pisi/inkscape-1.4.3-25/work/inkscape-1.4.3_2025-12-25_0d15f75042/src/extension/internal/pdfinput/poppler-utils.cpp:208:26: error: ‘const class Object’ has no member named ‘dictGetKey’; did you mean ‘dictGetVal’?
  208 |                 p = obj->dictGetKey(i);
      |                          ^~~~~~~~~~
      |                          dictGetVal
/var/pisi/inkscape-1.4.3-25/work/inkscape-1.4.3_2025-12-25_0d15f75042/src/extension/internal/pdfinput/poppler-utils.cpp:210:43: error: ‘const class Object’ has no member named ‘dictGetValNF’; did you mean ‘dictGetVal’?
  210 |                 const Object &obj2 = obj->dictGetValNF(i);
      |                                           ^~~~~~~~~~~~
      |                                           dictGetVal
/var/pisi/inkscape-1.4.3-25/work/inkscape-1.4.3_2025-12-25_0d15f75042/src/extension/internal/pdfinput/poppler-utils.cpp: In function ‘void _getFontsRecursive(std::shared_ptr, Dict*, const FontList&, std::set&, int)’:
/var/pisi/inkscape-1.4.3-25/work/inkscape-1.4.3_2025-12-25_0d15f75042/src/extension/internal/pdfinput/poppler-utils.cpp:551:40: error: ‘const class Object’ has no member named ‘streamGetDict’
  551 |             const Object resObj = obj2.streamGetDict()->lookup("Resources", &resourcesRef);
      |                                        ^~~~~~~~~~~~~
/var/pisi/inkscape-1.4.3-25/work/inkscape-1.4.3_2025-12-25_0d15f75042/src/extension/internal/pdfinput/pdf-parser.cpp: In constructor ‘PdfParser::PdfParser(std::shared_ptr, Inkscape::Extension::Internal::SvgBuilder*, Page*, const PDFRectangle*)’:
/var/pisi/inkscape-1.4.3-25/work/inkscape-1.4.3_2025-12-25_0d15f75042/src/extension/internal/pdfinput/pdf-parser.cpp:296:30: error: ‘std::__cxx11::basic_string’ is an inaccessible base of ‘GooString’
  296 |         catalog->indexToLabel(page->getNum() - 1, label);
      |         ~~~~~~~~~~~~~~~~~~~~~^~~~~~~~~~~~~~~~~~~~~~~~~~~
/var/pisi/inkscape-1.4.3-25/work/inkscape-1.4.3_2025-12-25_0d15f75042/src/extension/internal/pdfinput/pdf-parser.cpp:304:45: error: cannot convert ‘const PDFRectangle’ to ‘const PDFRectangle*’
  304 |     auto page_box = getRect(page->getCropBox());
      |                             ~~~~~~~~~~~~~~~~^~
      |                                             |
      |                                             const PDFRectangle
In file included from /var/pisi/inkscape-1.4.3-25/work/inkscape-1.4.3_2025-12-25_0d15f75042/src/extension/internal/pdfinput/pdf-parser.cpp:54:
/var/pisi/inkscape-1.4.3-25/work/inkscape-1.4.3_2025-12-25_0d15f75042/src/extension/internal/pdfinput/pdf-utils.h:61:49: note: initializing argument 1 of ‘Geom::Rect getRect(const PDFRectangle*)’
   61 | Geom::Rect getRect(_POPPLER_CONST PDFRectangle *box);
/var/pisi/inkscape-1.4.3-25/work/inkscape-1.4.3_2025-12-25_0d15f75042/src/extension/internal/pdfinput/pdf-parser.cpp:307:49: error: cannot convert ‘const PDFRectangle’ to ‘const PDFRectangle*’
  307 |     builder->setMargins(getRect(page->getTrimBox()) * scale,
      |                                 ~~~~~~~~~~~~~~~~^~
      |                                                 |
      |                                                 const PDFRectangle
/var/pisi/inkscape-1.4.3-25/work/inkscape-1.4.3_2025-12-25_0d15f75042/src/extension/internal/pdfinput/pdf-utils.h:61:49: note: initializing argument 1 of ‘Geom::Rect getRect(const PDFRectangle*)’
   61 | Geom::Rect getRect(_POPPLER_CONST PDFRectangle *box);
/var/pisi/inkscape-1.4.3-25/work/inkscape-1.4.3_2025-12-25_0d15f75042/src/extension/internal/pdfinput/pdf-parser.cpp:308:48: error: cannot convert ‘const PDFRectangle’ to ‘const PDFRectangle*’
  308 |                         getRect(page->getArtBox()) * scale,
      |                                 ~~~~~~~~~~~~~~~^~
      |                                                |
      |                                                const PDFRectangle
/var/pisi/inkscape-1.4.3-25/work/inkscape-1.4.3_2025-12-25_0d15f75042/src/extension/internal/pdfinput/pdf-utils.h:61:49: note: initializing argument 1 of ‘Geom::Rect getRect(const PDFRectangle*)’
   61 | Geom::Rect getRect(_POPPLER_CONST PDFRectangle *box);
/var/pisi/inkscape-1.4.3-25/work/inkscape-1.4.3_2025-12-25_0d15f75042/src/extension/internal/pdfinput/pdf-parser.cpp:309:50: error: cannot convert ‘const PDFRectangle’ to ‘const PDFRectangle*’
  309 |                         getRect(page->getBleedBox()) * scale);
      |                                 ~~~~~~~~~~~~~~~~~^~
      |                                                  |
      |                                                  const PDFRectangle
/var/pisi/inkscape-1.4.3-25/work/inkscape-1.4.3_2025-12-25_0d15f75042/src/extension/internal/pdfinput/pdf-utils.h:61:49: note: initializing argument 1 of ‘Geom::Rect getRect(const PDFRectangle*)’
   61 | Geom::Rect getRect(_POPPLER_CONST PDFRectangle *box);
/var/pisi/inkscape-1.4.3-25/work/inkscape-1.4.3_2025-12-25_0d15f75042/src/extension/internal/pdfinput/pdf-parser.cpp: In constructor ‘PdfParser::PdfParser(XRef*, Inkscape::Extension::Internal::SvgBuilder*, Dict*, const PDFRectangle*)’:
/var/pisi/inkscape-1.4.3-25/work/inkscape-1.4.3_2025-12-25_0d15f75042/src/extension/internal/pdfinput/pdf-parser.cpp:328:45: error: no matching function for call to ‘GfxState::GfxState(int, int, const PDFRectangle*&, int, bool)’
  328 |     state(new GfxState(72, 72, box, 0, false))
      |                                             ^
/var/pisi/inkscape-1.4.3-25/work/inkscape-1.4.3_2025-12-25_0d15f75042/src/extension/internal/pdfinput/pdf-parser.cpp:328:45: note: there are 2 candidates
In file included from /usr/include/poppler/Gfx.h:42,
                 from /var/pisi/inkscape-1.4.3-25/work/inkscape-1.4.3_2025-12-25_0d15f75042/src/extension/internal/pdfinput/pdf-parser.h:36,
                 from /var/pisi/inkscape-1.4.3-25/work/inkscape-1.4.3_2025-12-25_0d15f75042/src/extension/internal/pdfinput/pdf-parser.cpp:19:
/usr/include/poppler/GfxState.h:1834:5: note: candidate 1: ‘GfxState::GfxState(const GfxState*, bool)’
 1834 |     GfxState(const GfxState *state, bool copyPath);
      |     ^~~~~~~~
/usr/include/poppler/GfxState.h:1834:5: note: candidate expects 2 arguments, 5 provided
/usr/include/poppler/GfxState.h:1541:5: note: candidate 2: ‘GfxState::GfxState(double, double, const PDFRectangle&, int, bool)’
 1541 |     GfxState(double hDPIA, double vDPIA, const PDFRectangle &pageBox, int rotateA, bool upsideDown);
      |     ^~~~~~~~
/usr/include/poppler/GfxState.h:1541:62: note: no known conversion for argument 3 from ‘const PDFRectangle*’ to ‘const PDFRectangle&’
 1541 |     GfxState(double hDPIA, double vDPIA, const PDFRectangle &pageBox, int rotateA, bool upsideDown);
      |                                          ~~~~~~~~~~~~~~~~~~~~^~~~~~~
In file included from /var/pisi/inkscape-1.4.3-25/work/inkscape-1.4.3_2025-12-25_0d15f75042/src/extension/internal/pdfinput/pdf-parser.h:22:
/var/pisi/inkscape-1.4.3-25/work/inkscape-1.4.3_2025-12-25_0d15f75042/src/extension/internal/pdfinput/pdf-parser.cpp: In member function ‘void PdfParser::opSetExtGState(Object*, int)’:
/var/pisi/inkscape-1.4.3-25/work/inkscape-1.4.3_2025-12-25_0d15f75042/src/extension/internal/pdfinput/pdf-parser.cpp:820:57: error: ‘class Object’ has no member named ‘streamGetDict’
  820 |                 if (_POPPLER_CALL_ARGS_DEREF(obj4, obj3.streamGetDict()->lookup, "Group").isDict()) {
      |                                                         ^~~~~~~~~~~~~
/var/pisi/inkscape-1.4.3-25/work/inkscape-1.4.3_2025-12-25_0d15f75042/src/extension/internal/pdfinput/poppler-transition-api.h:156:51: note: in definition of macro ‘_POPPLER_CALL_ARGS’
  156 | #define _POPPLER_CALL_ARGS(ret, func, ...) (ret = func(__VA_ARGS__))
      |                                                   ^~~~
/var/pisi/inkscape-1.4.3-25/work/inkscape-1.4.3_2025-12-25_0d15f75042/src/extension/internal/pdfinput/pdf-parser.cpp:820:21: note: in expansion of macro ‘_POPPLER_CALL_ARGS_DEREF’
  820 |                 if (_POPPLER_CALL_ARGS_DEREF(obj4, obj3.streamGetDict()->lookup, "Group").isDict()) {
      |                     ^~~~~~~~~~~~~~~~~~~~~~~~
/var/pisi/inkscape-1.4.3-25/work/inkscape-1.4.3_2025-12-25_0d15f75042/src/extension/internal/pdfinput/pdf-parser.cpp: In member function ‘void PdfParser::doSoftMask(Object*, GBool, GfxColorSpace*, GBool, GBool, Function*, GfxColor*)’:
/var/pisi/inkscape-1.4.3-25/work/inkscape-1.4.3_2025-12-25_0d15f75042/src/extension/internal/pdfinput/pdf-parser.cpp:883:15: error: ‘class Object’ has no member named ‘streamGetDict’
  883 |   dict = str->streamGetDict();
      |               ^~~~~~~~~~~~~
/var/pisi/inkscape-1.4.3-25/work/inkscape-1.4.3_2025-12-25_0d15f75042/src/extension/internal/pdfinput/pdf-parser.cpp: In member function ‘void PdfParser::opSetFillGray(Object*, int)’:
/var/pisi/inkscape-1.4.3-25/work/inkscape-1.4.3_2025-12-25_0d15f75042/src/extension/internal/pdfinput/pdf-parser.cpp:995:23: error: cannot convert ‘GfxColor*’ to ‘const GfxColor&’
  995 |   state->setFillColor(&color);
      |                       ^~~~~~
      |                       |
      |                       GfxColor*
/usr/include/poppler/GfxState.h:1660:39: note: initializing argument 1 of ‘void GfxState::setFillColor(const GfxColor&)’
 1660 |     void setFillColor(const GfxColor &color) { fillColor = color; }
      |                       ~~~~~~~~~~~~~~~~^~~~~
/var/pisi/inkscape-1.4.3-25/work/inkscape-1.4.3_2025-12-25_0d15f75042/src/extension/internal/pdfinput/pdf-parser.cpp: In member function ‘void PdfParser::opSetStrokeGray(Object*, int)’:
/var/pisi/inkscape-1.4.3-25/work/inkscape-1.4.3_2025-12-25_0d15f75042/src/extension/internal/pdfinput/pdf-parser.cpp:1007:25: error: cannot convert ‘GfxColor*’ to ‘const GfxColor&’
 1007 |   state->setStrokeColor(&color);
      |                         ^~~~~~
      |                         |
      |                         GfxColor*
/usr/include/poppler/GfxState.h:1661:41: note: initializing argument 1 of ‘void GfxState::setStrokeColor(const GfxColor&)’
 1661 |     void setStrokeColor(const GfxColor &color) { strokeColor = color; }
      |                         ~~~~~~~~~~~~~~~~^~~~~
/var/pisi/inkscape-1.4.3-25/work/inkscape-1.4.3_2025-12-25_0d15f75042/src/extension/internal/pdfinput/pdf-parser.cpp: In member function ‘void PdfParser::opSetFillCMYKColor(Object*, int)’:
/var/pisi/inkscape-1.4.3-25/work/inkscape-1.4.3_2025-12-25_0d15f75042/src/extension/internal/pdfinput/pdf-parser.cpp:1022:23: error: cannot convert ‘GfxColor*’ to ‘const GfxColor&’
 1022 |   state->setFillColor(&color);
      |                       ^~~~~~
      |                       |
      |                       GfxColor*
/usr/include/poppler/GfxState.h:1660:39: note: initializing argument 1 of ‘void GfxState::setFillColor(const GfxColor&)’
 1660 |     void setFillColor(const GfxColor &color) { fillColor = color; }
      |                       ~~~~~~~~~~~~~~~~^~~~~
/var/pisi/inkscape-1.4.3-25/work/inkscape-1.4.3_2025-12-25_0d15f75042/src/extension/internal/pdfinput/pdf-parser.cpp: In member function ‘void PdfParser::opSetStrokeCMYKColor(Object*, int)’:
/var/pisi/inkscape-1.4.3-25/work/inkscape-1.4.3_2025-12-25_0d15f75042/src/extension/internal/pdfinput/pdf-parser.cpp:1036:25: error: cannot convert ‘GfxColor*’ to ‘const GfxColor&’
 1036 |   state->setStrokeColor(&color);
      |                         ^~~~~~
      |                         |
      |                         GfxColor*
/usr/include/poppler/GfxState.h:1661:41: note: initializing argument 1 of ‘void GfxState::setStrokeColor(const GfxColor&)’
 1661 |     void setStrokeColor(const GfxColor &color) { strokeColor = color; }
      |                         ~~~~~~~~~~~~~~~~^~~~~
/var/pisi/inkscape-1.4.3-25/work/inkscape-1.4.3_2025-12-25_0d15f75042/src/extension/internal/pdfinput/pdf-parser.cpp: In member function ‘void PdfParser::opSetFillRGBColor(Object*, int)’:
/var/pisi/inkscape-1.4.3-25/work/inkscape-1.4.3_2025-12-25_0d15f75042/src/extension/internal/pdfinput/pdf-parser.cpp:1050:23: error: cannot convert ‘GfxColor*’ to ‘const GfxColor&’
 1050 |   state->setFillColor(&color);
      |                       ^~~~~~
      |                       |
      |                       GfxColor*
/usr/include/poppler/GfxState.h:1660:39: note: initializing argument 1 of ‘void GfxState::setFillColor(const GfxColor&)’
 1660 |     void setFillColor(const GfxColor &color) { fillColor = color; }
      |                       ~~~~~~~~~~~~~~~~^~~~~
/var/pisi/inkscape-1.4.3-25/work/inkscape-1.4.3_2025-12-25_0d15f75042/src/extension/internal/pdfinput/pdf-parser.cpp: In member function ‘void PdfParser::opSetStrokeRGBColor(Object*, int)’:
/var/pisi/inkscape-1.4.3-25/work/inkscape-1.4.3_2025-12-25_0d15f75042/src/extension/internal/pdfinput/pdf-parser.cpp:1063:25: error: cannot convert ‘GfxColor*’ to ‘const GfxColor&’
 1063 |   state->setStrokeColor(&color);
      |                         ^~~~~~
      |                         |
      |                         GfxColor*
/usr/include/poppler/GfxState.h:1661:41: note: initializing argument 1 of ‘void GfxState::setStrokeColor(const GfxColor&)’
 1661 |     void setStrokeColor(const GfxColor &color) { strokeColor = color; }
      |                         ~~~~~~~~~~~~~~~~^~~~~
/var/pisi/inkscape-1.4.3-25/work/inkscape-1.4.3_2025-12-25_0d15f75042/src/extension/internal/pdfinput/pdf-parser.cpp: In member function ‘void PdfParser::opSetFillColorSpace(Object*, int)’:
/var/pisi/inkscape-1.4.3-25/work/inkscape-1.4.3_2025-12-25_0d15f75042/src/extension/internal/pdfinput/pdf-parser.cpp:1079:25: error: cannot convert ‘GfxColor*’ to ‘const GfxColor&’
 1079 |     state->setFillColor(&color);
      |                         ^~~~~~
      |                         |
      |                         GfxColor*
/usr/include/poppler/GfxState.h:1660:39: note: initializing argument 1 of ‘void GfxState::setFillColor(const GfxColor&)’
 1660 |     void setFillColor(const GfxColor &color) { fillColor = color; }
      |                       ~~~~~~~~~~~~~~~~^~~~~
/var/pisi/inkscape-1.4.3-25/work/inkscape-1.4.3_2025-12-25_0d15f75042/src/extension/internal/pdfinput/pdf-parser.cpp: In member function ‘void PdfParser::opSetStrokeColorSpace(Object*, int)’:
/var/pisi/inkscape-1.4.3-25/work/inkscape-1.4.3_2025-12-25_0d15f75042/src/extension/internal/pdfinput/pdf-parser.cpp:1100:27: error: cannot convert ‘GfxColor*’ to ‘const GfxColor&’
 1100 |     state->setStrokeColor(&color);
      |                           ^~~~~~
      |                           |
      |                           GfxColor*
/usr/include/poppler/GfxState.h:1661:41: note: initializing argument 1 of ‘void GfxState::setStrokeColor(const GfxColor&)’
 1661 |     void setStrokeColor(const GfxColor &color) { strokeColor = color; }
      |                         ~~~~~~~~~~~~~~~~^~~~~
/var/pisi/inkscape-1.4.3-25/work/inkscape-1.4.3_2025-12-25_0d15f75042/src/extension/internal/pdfinput/pdf-parser.cpp: In member function ‘void PdfParser::opSetFillColor(Object*, int)’:
/var/pisi/inkscape-1.4.3-25/work/inkscape-1.4.3_2025-12-25_0d15f75042/src/extension/internal/pdfinput/pdf-parser.cpp:1120:23: error: cannot convert ‘GfxColor*’ to ‘const GfxColor&’
 1120 |   state->setFillColor(&color);
      |                       ^~~~~~
      |                       |
      |                       GfxColor*
/usr/include/poppler/GfxState.h:1660:39: note: initializing argument 1 of ‘void GfxState::setFillColor(const GfxColor&)’
 1660 |     void setFillColor(const GfxColor &color) { fillColor = color; }
      |                       ~~~~~~~~~~~~~~~~^~~~~
/var/pisi/inkscape-1.4.3-25/work/inkscape-1.4.3_2025-12-25_0d15f75042/src/extension/internal/pdfinput/pdf-parser.cpp: In member function ‘void PdfParser::opSetStrokeColor(Object*, int)’:
/var/pisi/inkscape-1.4.3-25/work/inkscape-1.4.3_2025-12-25_0d15f75042/src/extension/internal/pdfinput/pdf-parser.cpp:1137:25: error: cannot convert ‘GfxColor*’ to ‘const GfxColor&’
 1137 |   state->setStrokeColor(&color);
      |                         ^~~~~~
      |                         |
      |                         GfxColor*
/usr/include/poppler/GfxState.h:1661:41: note: initializing argument 1 of ‘void GfxState::setStrokeColor(const GfxColor&)’
 1661 |     void setStrokeColor(const GfxColor &color) { strokeColor = color; }
      |                         ~~~~~~~~~~~~~~~~^~~~~
/var/pisi/inkscape-1.4.3-25/work/inkscape-1.4.3_2025-12-25_0d15f75042/src/extension/internal/pdfinput/pdf-parser.cpp: In member function ‘void PdfParser::opSetFillColorN(Object*, int)’:
/var/pisi/inkscape-1.4.3-25/work/inkscape-1.4.3_2025-12-25_0d15f75042/src/extension/internal/pdfinput/pdf-parser.cpp:1158:27: error: cannot convert ‘GfxColor*’ to ‘const GfxColor&’
 1158 |       state->setFillColor(&color);
      |                           ^~~~~~
      |                           |
      |                           GfxColor*
/usr/include/poppler/GfxState.h:1660:39: note: initializing argument 1 of ‘void GfxState::setFillColor(const GfxColor&)’
 1660 |     void setFillColor(const GfxColor &color) { fillColor = color; }
      |                       ~~~~~~~~~~~~~~~~^~~~~
/var/pisi/inkscape-1.4.3-25/work/inkscape-1.4.3_2025-12-25_0d15f75042/src/extension/internal/pdfinput/pdf-parser.cpp:1177:25: error: cannot convert ‘GfxColor*’ to ‘const GfxColor&’
 1177 |     state->setFillColor(&color);
      |                         ^~~~~~
      |                         |
      |                         GfxColor*
/usr/include/poppler/GfxState.h:1660:39: note: initializing argument 1 of ‘void GfxState::setFillColor(const GfxColor&)’
 1660 |     void setFillColor(const GfxColor &color) { fillColor = color; }
      |                       ~~~~~~~~~~~~~~~~^~~~~
/var/pisi/inkscape-1.4.3-25/work/inkscape-1.4.3_2025-12-25_0d15f75042/src/extension/internal/pdfinput/pdf-parser.cpp: In member function ‘void PdfParser::opSetStrokeColorN(Object*, int)’:
/var/pisi/inkscape-1.4.3-25/work/inkscape-1.4.3_2025-12-25_0d15f75042/src/extension/internal/pdfinput/pdf-parser.cpp:1201:29: error: cannot convert ‘GfxColor*’ to ‘const GfxColor&’
 1201 |       state->setStrokeColor(&color);
      |                             ^~~~~~
      |                             |
      |                             GfxColor*
/usr/include/poppler/GfxState.h:1661:41: note: initializing argument 1 of ‘void GfxState::setStrokeColor(const GfxColor&)’
 1661 |     void setStrokeColor(const GfxColor &color) { strokeColor = color; }
      |                         ~~~~~~~~~~~~~~~~^~~~~
/var/pisi/inkscape-1.4.3-25/work/inkscape-1.4.3_2025-12-25_0d15f75042/src/extension/internal/pdfinput/pdf-parser.cpp:1220:27: error: cannot convert ‘GfxColor*’ to ‘const GfxColor&’
 1220 |     state->setStrokeColor(&color);
      |                           ^~~~~~
      |                           |
      |                           GfxColor*
/usr/include/poppler/GfxState.h:1661:41: note: initializing argument 1 of ‘void GfxState::setStrokeColor(const GfxColor&)’
 1661 |     void setStrokeColor(const GfxColor &color) { strokeColor = color; }
      |                         ~~~~~~~~~~~~~~~~^~~~~
/var/pisi/inkscape-1.4.3-25/work/inkscape-1.4.3_2025-12-25_0d15f75042/src/extension/internal/pdfinput/pdf-parser.cpp: In member function ‘void PdfParser::doFunctionShFill1(GfxFunctionShading*, double, double, double, double, GfxColor*, int)’:
/var/pisi/inkscape-1.4.3-25/work/inkscape-1.4.3_2025-12-25_0d15f75042/src/extension/internal/pdfinput/pdf-parser.cpp:1703:25: error: cannot convert ‘GfxColor*’ to ‘const GfxColor&’
 1703 |     state->setFillColor(&fillColor);
      |                         ^~~~~~~~~~
      |                         |
      |                         GfxColor*
/usr/include/poppler/GfxState.h:1660:39: note: initializing argument 1 of ‘void GfxState::setFillColor(const GfxColor&)’
 1660 |     void setFillColor(const GfxColor &color) { fillColor = color; }
      |                       ~~~~~~~~~~~~~~~~^~~~~
/var/pisi/inkscape-1.4.3-25/work/inkscape-1.4.3_2025-12-25_0d15f75042/src/extension/internal/pdfinput/pdf-parser.cpp: In member function ‘void PdfParser::gouraudFillTriangle(double, double, GfxColor*, double, double, GfxColor*, double, double, GfxColor*, int, int)’:
/var/pisi/inkscape-1.4.3-25/work/inkscape-1.4.3_2025-12-25_0d15f75042/src/extension/internal/pdfinput/pdf-parser.cpp:1802:25: error: cannot convert ‘GfxColor*’ to ‘const GfxColor&’
 1802 |     state->setFillColor(color0);
      |                         ^~~~~~
      |                         |
      |                         GfxColor*
/usr/include/poppler/GfxState.h:1660:39: note: initializing argument 1 of ‘void GfxState::setFillColor(const GfxColor&)’
 1660 |     void setFillColor(const GfxColor &color) { fillColor = color; }
      |                       ~~~~~~~~~~~~~~~~^~~~~
/var/pisi/inkscape-1.4.3-25/work/inkscape-1.4.3_2025-12-25_0d15f75042/src/extension/internal/pdfinput/pdf-parser.cpp: In member function ‘void PdfParser::fillPatch(const GfxPatch*, int, int)’:
/var/pisi/inkscape-1.4.3-25/work/inkscape-1.4.3_2025-12-25_0d15f75042/src/extension/internal/pdfinput/pdf-parser.cpp:1880:25: error: cannot convert ‘GfxColor*’ to ‘const GfxColor&’
 1880 |     state->setFillColor(&color);
      |                         ^~~~~~
      |                         |
      |                         GfxColor*
/usr/include/poppler/GfxState.h:1660:39: note: initializing argument 1 of ‘void GfxState::setFillColor(const GfxColor&)’
 1660 |     void setFillColor(const GfxColor &color) { fillColor = color; }
      |                       ~~~~~~~~~~~~~~~~^~~~~
/var/pisi/inkscape-1.4.3-25/work/inkscape-1.4.3_2025-12-25_0d15f75042/src/extension/internal/pdfinput/pdf-parser.cpp: In member function ‘void PdfParser::opXObject(Object*, int)’:
/var/pisi/inkscape-1.4.3-25/work/inkscape-1.4.3_2025-12-25_0d15f75042/src/extension/internal/pdfinput/pdf-parser.cpp:2380:35: error: ‘class Object’ has no member named ‘streamGetDict’
 2380 |     _POPPLER_CALL_ARGS(obj2, obj1.streamGetDict()->lookup, "OC");
      |                                   ^~~~~~~~~~~~~
/var/pisi/inkscape-1.4.3-25/work/inkscape-1.4.3_2025-12-25_0d15f75042/src/extension/internal/pdfinput/poppler-transition-api.h:156:51: note: in definition of macro ‘_POPPLER_CALL_ARGS’
  156 | #define _POPPLER_CALL_ARGS(ret, func, ...) (ret = func(__VA_ARGS__))
      |                                                   ^~~~
/var/pisi/inkscape-1.4.3-25/work/inkscape-1.4.3_2025-12-25_0d15f75042/src/extension/internal/pdfinput/pdf-parser.cpp:2398:35: error: ‘class Object’ has no member named ‘streamGetDict’
 2398 |     _POPPLER_CALL_ARGS(obj2, obj1.streamGetDict()->lookup, "Subtype");
      |                                   ^~~~~~~~~~~~~
/var/pisi/inkscape-1.4.3-25/work/inkscape-1.4.3_2025-12-25_0d15f75042/src/extension/internal/pdfinput/poppler-transition-api.h:156:51: note: in definition of macro ‘_POPPLER_CALL_ARGS’
  156 | #define _POPPLER_CALL_ARGS(ret, func, ...) (ret = func(__VA_ARGS__))
      |                                                   ^~~~
/var/pisi/inkscape-1.4.3-25/work/inkscape-1.4.3_2025-12-25_0d15f75042/src/extension/internal/pdfinput/pdf-parser.cpp:2406:39: error: ‘class Object’ has no member named ‘streamGetDict’
 2406 |         _POPPLER_CALL_ARGS(obj3, obj1.streamGetDict()->lookup, "Level1");
      |                                       ^~~~~~~~~~~~~
/var/pisi/inkscape-1.4.3-25/work/inkscape-1.4.3_2025-12-25_0d15f75042/src/extension/internal/pdfinput/poppler-transition-api.h:156:51: note: in definition of macro ‘_POPPLER_CALL_ARGS’
  156 | #define _POPPLER_CALL_ARGS(ret, func, ...) (ret = func(__VA_ARGS__))
      |                                                   ^~~~
/var/pisi/inkscape-1.4.3-25/work/inkscape-1.4.3_2025-12-25_0d15f75042/src/extension/internal/pdfinput/pdf-parser.cpp: In member function ‘void PdfParser::doImage(Object*, Stream*, GBool)’:
/var/pisi/inkscape-1.4.3-25/work/inkscape-1.4.3_2025-12-25_0d15f75042/src/extension/internal/pdfinput/pdf-parser.cpp:2599:33: error: ‘class Object’ has no member named ‘streamGetDict’
 2599 |             maskDict = smaskObj.streamGetDict();
      |                                 ^~~~~~~~~~~~~
/var/pisi/inkscape-1.4.3-25/work/inkscape-1.4.3_2025-12-25_0d15f75042/src/extension/internal/pdfinput/pdf-parser.cpp:2677:32: error: ‘class Object’ has no member named ‘streamGetDict’
 2677 |             maskDict = maskObj.streamGetDict();
      |                                ^~~~~~~~~~~~~
/var/pisi/inkscape-1.4.3-25/work/inkscape-1.4.3_2025-12-25_0d15f75042/src/extension/internal/pdfinput/pdf-parser.cpp: In member function ‘void PdfParser::doForm(Object*, double*)’:
/var/pisi/inkscape-1.4.3-25/work/inkscape-1.4.3_2025-12-25_0d15f75042/src/extension/internal/pdfinput/pdf-parser.cpp:2777:17: error: ‘class Object’ has no member named ‘streamGetDict’
 2777 |     dict = str->streamGetDict();
      |                 ^~~~~~~~~~~~~
/var/pisi/inkscape-1.4.3-25/work/inkscape-1.4.3_2025-12-25_0d15f75042/src/extension/internal/pdfinput/pdf-parser.cpp: In member function ‘void PdfParser::loadOptionalContentLayers(Dict*)’:
/var/pisi/inkscape-1.4.3-25/work/inkscape-1.4.3_2025-12-25_0d15f75042/src/extension/internal/pdfinput/pdf-parser.cpp:3174:45: error: invalid use of incomplete type ‘const class OCGs’
 3174 |                 for (auto &[ref, ocg] : ocgs->getOCGs()) {
      |                                             ^~
In file included from /usr/include/poppler/PDFDoc.h:62,
                 from /var/pisi/inkscape-1.4.3-25/work/inkscape-1.4.3_2025-12-25_0d15f75042/src/extension/internal/pdfinput/pdf-parser.cpp:47:
/usr/include/poppler/Catalog.h:66:7: note: forward declaration of ‘class OCGs’
   66 | class OCGs;
      |       ^~~~
/var/pisi/inkscape-1.4.3-25/work/inkscape-1.4.3_2025-12-25_0d15f75042/src/extension/internal/pdfinput/pdf-parser.cpp:3176:54: error: ‘OptionalContentGroup’ has not been declared
 3176 |                         visible = ocg->getState() == OptionalContentGroup::On;
      |                                                      ^~~~~~~~~~~~~~~~~~~~
make[2]: *** [src/CMakeFiles/inkscape_base.dir/build.make:2032: src/CMakeFiles/inkscape_base.dir/extension/internal/pdfinput/poppler-utils.cpp.o] Error 1
make[2]: *** Waiting for unfinished jobs....
make[2]: *** [src/CMakeFiles/inkscape_base.dir/build.make:2004: src/CMakeFiles/inkscape_base.dir/extension/internal/pdfinput/pdf-parser.cpp.o] Error 1
/var/pisi/inkscape-1.4.3-25/work/inkscape-1.4.3_2025-12-25_0d15f75042/src/extension/internal/pdfinput/poppler-cairo-font-engine.cpp: In static member function ‘static CairoFreeTypeFont* CairoFreeTypeFont::create(const std::shared_ptr&, XRef*, FT_Library, CairoFontEngine*, bool)’:
/var/pisi/inkscape-1.4.3-25/work/inkscape-1.4.3_2025-12-25_0d15f75042/src/extension/internal/pdfinput/poppler-cairo-font-engine.cpp:388:39: error: cannot convert ‘const std::array’ to ‘char**’ in assignment
  388 |             enc = gfx8bit->getEncoding();
      |                   ~~~~~~~~~~~~~~~~~~~~^~
      |                                       |
      |                                       const std::array
/var/pisi/inkscape-1.4.3-25/work/inkscape-1.4.3_2025-12-25_0d15f75042/src/extension/internal/pdfinput/poppler-cairo-font-engine.cpp: In static member function ‘static CairoType3Font* CairoType3Font::create(const std::shared_ptr&, PDFDoc*, CairoFontEngine*, bool, XRef*)’:
/var/pisi/inkscape-1.4.3-25/work/inkscape-1.4.3_2025-12-25_0d15f75042/src/extension/internal/pdfinput/poppler-cairo-font-engine.cpp:697:38: error: cannot convert ‘const std::array’ to ‘char**’ in initialization
  697 |     char **enc = gfx8bit->getEncoding();
      |                  ~~~~~~~~~~~~~~~~~~~~^~
      |                                      |
      |                                      const std::array
/var/pisi/inkscape-1.4.3-25/work/inkscape-1.4.3_2025-12-25_0d15f75042/src/extension/internal/pdfinput/poppler-cairo-font-engine.cpp:703:51: error: cannot convert ‘const std::string’ {aka ‘const std::__cxx11::basic_string’} to ‘const char*’
  703 |                 if (strcmp(name, charProcs->getKey(j)) == 0) {
      |                                  ~~~~~~~~~~~~~~~~~^~~
      |                                                   |
      |                                                   const std::string {aka const std::__cxx11::basic_string}
In file included from /usr/include/freetype2/freetype/config/ftstdlib.h:88,
                 from /usr/include/freetype2/freetype/config/ftconfig.h:41,
                 from /usr/include/freetype2/freetype/freetype.h:24,
                 from /usr/include/cairo/cairo-ft.h:47,
                 from /var/pisi/inkscape-1.4.3-25/work/inkscape-1.4.3_2025-12-25_0d15f75042/src/extension/internal/pdfinput/poppler-cairo-font-engine.h:35,
                 from /var/pisi/inkscape-1.4.3-25/work/inkscape-1.4.3_2025-12-25_0d15f75042/src/extension/internal/pdfinput/poppler-cairo-font-engine.cpp:44:
/usr/include/string.h:156:50: note: initializing argument 2 of ‘int strcmp(const char*, const char*)’
  156 | extern int strcmp (const char *__s1, const char *__s2)
      |                                      ~~~~~~~~~~~~^~~~
/var/pisi/inkscape-1.4.3-25/work/inkscape-1.4.3_2025-12-25_0d15f75042/src/extension/internal/pdfinput/svg-builder.cpp: In member function ‘std::string Inkscape::Extension::Internal::SvgBuilder::convertGfxColor(const GfxColor*, GfxColorSpace*)’:
/var/pisi/inkscape-1.4.3-25/work/inkscape-1.4.3_2025-12-25_0d15f75042/src/extension/internal/pdfinput/svg-builder.cpp:415:19: error: cannot convert ‘const GfxColor*’ to ‘const GfxColor&’
  415 |     space->getRGB(color, &rgb);
      |                   ^~~~~
      |                   |
      |                   const GfxColor*
In file included from /usr/include/poppler/Gfx.h:42,
                 from /var/pisi/inkscape-1.4.3-25/work/inkscape-1.4.3_2025-12-25_0d15f75042/src/extension/internal/pdfinput/svg-builder.h:30,
                 from /var/pisi/inkscape-1.4.3-25/work/inkscape-1.4.3_2025-12-25_0d15f75042/src/extension/internal/pdfinput/svg-builder.cpp:17:
/usr/include/poppler/GfxState.h:272:41: note: initializing argument 1 of ‘virtual void GfxColorSpace::getRGB(const GfxColor&, GfxRGB*) const’
  272 |     virtual void getRGB(const GfxColor &color, GfxRGB *rgb) const = 0;
      |                         ~~~~~~~~~~~~~~~~^~~~~
/var/pisi/inkscape-1.4.3-25/work/inkscape-1.4.3_2025-12-25_0d15f75042/src/extension/internal/pdfinput/svg-builder.cpp: In member function ‘void Inkscape::Extension::Internal::SvgBuilder::_setStrokeStyle(SPCSSAttr*, GfxState*)’:
/var/pisi/inkscape-1.4.3-25/work/inkscape-1.4.3_2025-12-25_0d15f75042/src/extension/internal/pdfinput/svg-builder.cpp:483:86: error: cannot convert ‘const GfxColor’ to ‘const GfxColor*’
  483 |         sp_repr_css_set_property(css, "stroke", convertGfxColor(state->getStrokeColor(), space).c_str());
      |                                                                 ~~~~~~~~~~~~~~~~~~~~~^~
      |                                                                                      |
      |                                                                                      const GfxColor
/var/pisi/inkscape-1.4.3-25/work/inkscape-1.4.3_2025-12-25_0d15f75042/src/extension/internal/pdfinput/svg-builder.cpp:395:57: note: initializing argument 1 of ‘std::string Inkscape::Extension::Internal::SvgBuilder::convertGfxColor(const GfxColor*, GfxColorSpace*)’
  395 | std::string SvgBuilder::convertGfxColor(const GfxColor *color, GfxColorSpace *space)
      |                                         ~~~~~~~~~~~~~~~~^~~~~
/var/pisi/inkscape-1.4.3-25/work/inkscape-1.4.3_2025-12-25_0d15f75042/src/extension/internal/pdfinput/svg-builder.cpp: In member function ‘void Inkscape::Extension::Internal::SvgBuilder::_setFillStyle(SPCSSAttr*, GfxState*, bool)’:
/var/pisi/inkscape-1.4.3-25/work/inkscape-1.4.3_2025-12-25_0d15f75042/src/extension/internal/pdfinput/svg-builder.cpp:575:82: error: cannot convert ‘const GfxColor’ to ‘const GfxColor*’
  575 |         sp_repr_css_set_property(css, "fill", convertGfxColor(state->getFillColor(), space).c_str());
      |                                                               ~~~~~~~~~~~~~~~~~~~^~
      |                                                                                  |
      |                                                                                  const GfxColor
/var/pisi/inkscape-1.4.3-25/work/inkscape-1.4.3_2025-12-25_0d15f75042/src/extension/internal/pdfinput/svg-builder.cpp:395:57: note: initializing argument 1 of ‘std::string Inkscape::Extension::Internal::SvgBuilder::convertGfxColor(const GfxColor*, GfxColorSpace*)’
  395 | std::string SvgBuilder::convertGfxColor(const GfxColor *color, GfxColorSpace *space)
      |                                         ~~~~~~~~~~~~~~~~^~~~~
/var/pisi/inkscape-1.4.3-25/work/inkscape-1.4.3_2025-12-25_0d15f75042/src/extension/internal/pdfinput/svg-builder.cpp: In member function ‘void Inkscape::Extension::Internal::SvgBuilder::_addStopToGradient(Inkscape::XML::Node*, double, GfxColor*, GfxColorSpace*, double)’:
/var/pisi/inkscape-1.4.3-25/work/inkscape-1.4.3_2025-12-25_0d15f75042/src/extension/internal/pdfinput/svg-builder.cpp:1217:23: error: cannot convert ‘GfxColor*’ to ‘const GfxColor&’
 1217 |         space->getRGB(color, &rgb);
      |                       ^~~~~
      |                       |
      |                       GfxColor*
/usr/include/poppler/GfxState.h:272:41: note: initializing argument 1 of ‘virtual void GfxColorSpace::getRGB(const GfxColor&, GfxRGB*) const’
  272 |     virtual void getRGB(const GfxColor &color, GfxRGB *rgb) const = 0;
      |                         ~~~~~~~~~~~~~~~~^~~~~
/var/pisi/inkscape-1.4.3-25/work/inkscape-1.4.3_2025-12-25_0d15f75042/src/extension/internal/pdfinput/svg-builder.cpp: In member function ‘void Inkscape::Extension::Internal::SvgBuilder::addChar(GfxState*, double, double, double, double, double, double, double, double, CharCode, int, const Unicode*, int)’:
/var/pisi/inkscape-1.4.3-25/work/inkscape-1.4.3_2025-12-25_0d15f75042/src/extension/internal/pdfinput/svg-builder.cpp:1895:17: warning: ‘template class std::__cxx11::wstring_convert’ is deprecated [-Wdeprecated-declarations]
 1895 |     static std::wstring_convert, char32_t> conv1;
      |                 ^~~~~~~~~~~~~~~
In file included from /usr/include/c++/15.2.0/locale:47,
                 from /usr/include/c++/15.2.0/iomanip:53,
                 from /var/pisi/inkscape-1.4.3-25/work/inkscape-1.4.3_2025-12-25_0d15f75042/src/extension/internal/pdfinput/svg-builder.cpp:23:
/usr/include/c++/15.2.0/bits/locale_conv.h:262:33: note: declared here
  262 |     class _GLIBCXX17_DEPRECATED wstring_convert
      |                                 ^~~~~~~~~~~~~~~
/var/pisi/inkscape-1.4.3-25/work/inkscape-1.4.3_2025-12-25_0d15f75042/src/extension/internal/pdfinput/svg-builder.cpp: In member function ‘Inkscape::XML::Node* Inkscape::Extension::Internal::SvgBuilder::_createImage(Stream*, int, int, GfxImageColorMap*, bool, int*, bool, bool)’:
/var/pisi/inkscape-1.4.3-25/work/inkscape-1.4.3_2025-12-25_0d15f75042/src/extension/internal/pdfinput/svg-builder.cpp:2098:29: warning: ignoring return value of ‘bool ImageStream::rewind()’, declared with attribute ‘nodiscard’ [-Wunused-result]
 2098 |         image_stream->rewind();
      |         ~~~~~~~~~~~~~~~~~~~~^~
In file included from /var/pisi/inkscape-1.4.3-25/work/inkscape-1.4.3_2025-12-25_0d15f75042/src/extension/internal/pdfinput/svg-builder.cpp:34:
/usr/include/poppler/Stream.h:476:24: note: declared here
  476 |     [[nodiscard]] bool rewind();
      |                        ^~~~~~
/var/pisi/inkscape-1.4.3-25/work/inkscape-1.4.3_2025-12-25_0d15f75042/src/extension/internal/pdfinput/svg-builder.cpp:2128:29: warning: ignoring return value of ‘bool ImageStream::rewind()’, declared with attribute ‘nodiscard’ [-Wunused-result]
 2128 |         image_stream->rewind();
      |         ~~~~~~~~~~~~~~~~~~~~^~
/usr/include/poppler/Stream.h:476:24: note: declared here
  476 |     [[nodiscard]] bool rewind();
      |                        ^~~~~~
make[2]: *** [src/CMakeFiles/inkscape_base.dir/build.make:2046: src/CMakeFiles/inkscape_base.dir/extension/internal/pdfinput/poppler-cairo-font-engine.cpp.o] Error 1
make[2]: *** [src/CMakeFiles/inkscape_base.dir/build.make:2018: src/CMakeFiles/inkscape_base.dir/extension/internal/pdfinput/svg-builder.cpp.o] Error 1
/var/pisi/inkscape-1.4.3-25/work/inkscape-1.4.3_2025-12-25_0d15f75042/src/extension/internal/pdfinput/pdf-input.cpp: In member function ‘void Inkscape::Extension::Internal::PdfInput::add_builder_page(std::shared_ptr, Inkscape::Extension::Internal::SvgBuilder*, SPDocument*, int, const std::string&, double)’:
/var/pisi/inkscape-1.4.3-25/work/inkscape-1.4.3_2025-12-25_0d15f75042/src/extension/internal/pdfinput/pdf-input.cpp:814:38: error: cannot convert ‘const PDFRectangle’ to ‘const PDFRectangle*’ in assignment
  814 |         clipToBox = page->getMediaBox();
      |                     ~~~~~~~~~~~~~~~~~^~
      |                                      |
      |                                      const PDFRectangle
/var/pisi/inkscape-1.4.3-25/work/inkscape-1.4.3_2025-12-25_0d15f75042/src/extension/internal/pdfinput/pdf-input.cpp:816:37: error: cannot convert ‘const PDFRectangle’ to ‘const PDFRectangle*’ in assignment
  816 |         clipToBox = page->getCropBox();
      |                     ~~~~~~~~~~~~~~~~^~
      |                                     |
      |                                     const PDFRectangle
/var/pisi/inkscape-1.4.3-25/work/inkscape-1.4.3_2025-12-25_0d15f75042/src/extension/internal/pdfinput/pdf-input.cpp:818:37: error: cannot convert ‘const PDFRectangle’ to ‘const PDFRectangle*’ in assignment
  818 |         clipToBox = page->getTrimBox();
      |                     ~~~~~~~~~~~~~~~~^~
      |                                     |
      |                                     const PDFRectangle
/var/pisi/inkscape-1.4.3-25/work/inkscape-1.4.3_2025-12-25_0d15f75042/src/extension/internal/pdfinput/pdf-input.cpp:820:38: error: cannot convert ‘const PDFRectangle’ to ‘const PDFRectangle*’ in assignment
  820 |         clipToBox = page->getBleedBox();
      |                     ~~~~~~~~~~~~~~~~~^~
      |                                      |
      |                                      const PDFRectangle
/var/pisi/inkscape-1.4.3-25/work/inkscape-1.4.3_2025-12-25_0d15f75042/src/extension/internal/pdfinput/pdf-input.cpp:822:36: error: cannot convert ‘const PDFRectangle’ to ‘const PDFRectangle*’ in assignment
  822 |         clipToBox = page->getArtBox();
      |                     ~~~~~~~~~~~~~~~^~
      |                                    |
      |                                    const PDFRectangle
make[2]: *** [src/CMakeFiles/inkscape_base.dir/build.make:1990: src/CMakeFiles/inkscape_base.dir/extension/internal/pdfinput/pdf-input.cpp.o] Error 1
make[1]: *** [CMakeFiles/Makefile2:2447: src/CMakeFiles/inkscape_base.dir/all] Error 2
make: *** [Makefile:156: all] Error 2
Traceback (most recent call last):
  File "/var/pisi/inkscape/actions.py", line 37, in build
    cmaketools.make()
  File "/usr/lib/pisilinux/pisi/actionsapi/cmaketools.py", line 77, in make
    if system(command):
  File "/usr/lib/pisilinux/pisi/actionsapi/shelltools.py", line 255, in system
    error(_("Command \"%s\" failed, return value was %d.") % (command, retValue))
  File "/usr/lib/pisilinux/pisi/actionsapi/__init__.py", line 27, in error
    raise Error(msg)
pisi.actionsapi.Error: Command "make -j5" failed, return value was 2.
Action script error caught.
*** 1 error(s), 0 warning(s)
Program terminated.