autoreconf: export WARNINGS=
autoreconf: Entering directory '.'
autoreconf: configure.ac: not using Gettext
autoreconf: running: aclocal --force -I m4
autoreconf: configure.ac: tracing
autoreconf: running: libtoolize --copy --force
autoreconf: running: intltoolize --copy --force
autoreconf: running: gtkdocize --copy
autoreconf: running: aclocal --force -I m4
autoreconf: running: /usr/bin/autoconf --force
configure.ac:6: warning: 'AM_CONFIG_HEADER': this macro is obsolete.
configure.ac:6: You should use the 'AC_CONFIG_HEADERS' macro instead.
aclocal.m4:1541: AM_CONFIG_HEADER is expanded from...
configure.ac:6: the top level
configure.ac:34: warning: The macro 'AC_HEADER_STDC' is obsolete.
configure.ac:34: You should run autoupdate.
./lib/autoconf/headers.m4:663: AC_HEADER_STDC is expanded from...
configure.ac:34: the top level
configure.ac:203: warning: The macro 'AC_HELP_STRING' is obsolete.
configure.ac:203: You should run autoupdate.
./lib/autoconf/general.m4:204: AC_HELP_STRING is expanded from...
./lib/autoconf/general.m4:1553: AC_ARG_WITH is expanded from...
configure.ac:203: the top level
configure.ac:299: warning: The macro 'GLIB_GNU_GETTEXT' is obsolete.
configure.ac:299: You should run autoupdate.
aclocal.m4:388: GLIB_GNU_GETTEXT is expanded from...
aclocal.m4:488: AM_GLIB_GNU_GETTEXT is expanded from...
configure.ac:299: the top level
configure.ac:299: warning: The macro 'AC_TRY_LINK' is obsolete.
configure.ac:299: You should run autoupdate.
./lib/autoconf/general.m4:2918: AC_TRY_LINK is expanded from...
lib/m4sugar/m4sh.m4:690: _AS_IF_ELSE is expanded from...
lib/m4sugar/m4sh.m4:697: AS_IF is expanded from...
./lib/autoconf/general.m4:2249: AC_CACHE_VAL is expanded from...
./lib/autoconf/general.m4:2270: AC_CACHE_CHECK is expanded from...
aclocal.m4:73: GLIB_LC_MESSAGES is expanded from...
aclocal.m4:388: GLIB_GNU_GETTEXT is expanded from...
aclocal.m4:488: AM_GLIB_GNU_GETTEXT is expanded from...
configure.ac:299: the top level
configure.ac:299: warning: The macro 'AC_TRY_LINK' is obsolete.
configure.ac:299: You should run autoupdate.
./lib/autoconf/general.m4:2918: AC_TRY_LINK is expanded from...
lib/m4sugar/m4sh.m4:690: _AS_IF_ELSE is expanded from...
lib/m4sugar/m4sh.m4:697: AS_IF is expanded from...
./lib/autoconf/general.m4:2249: AC_CACHE_VAL is expanded from...
./lib/autoconf/general.m4:2270: AC_CACHE_CHECK is expanded from...
lib/m4sugar/m4sh.m4:697: AS_IF is expanded from...
./lib/autoconf/headers.m4:89: _AC_CHECK_HEADER_COMPILE is expanded from...
./lib/autoconf/headers.m4:56: AC_CHECK_HEADER is expanded from...
aclocal.m4:172: GLIB_WITH_NLS is expanded from...
aclocal.m4:388: GLIB_GNU_GETTEXT is expanded from...
aclocal.m4:488: AM_GLIB_GNU_GETTEXT is expanded from...
configure.ac:299: the top level
configure.ac:299: warning: The macro 'AC_TRY_LINK' is obsolete.
configure.ac:299: You should run autoupdate.
./lib/autoconf/general.m4:2918: AC_TRY_LINK is expanded from...
lib/m4sugar/m4sh.m4:697: AS_IF is expanded from...
./lib/autoconf/headers.m4:89: _AC_CHECK_HEADER_COMPILE is expanded from...
./lib/autoconf/headers.m4:56: AC_CHECK_HEADER is expanded from...
aclocal.m4:172: GLIB_WITH_NLS is expanded from...
aclocal.m4:388: GLIB_GNU_GETTEXT is expanded from...
aclocal.m4:488: AM_GLIB_GNU_GETTEXT is expanded from...
configure.ac:299: the top level
configure.ac:299: warning: The macro 'AC_OUTPUT_COMMANDS' is obsolete.
configure.ac:299: You should run autoupdate.
./lib/autoconf/status.m4:1025: AC_OUTPUT_COMMANDS is expanded from...
aclocal.m4:172: GLIB_WITH_NLS is expanded from...
aclocal.m4:388: GLIB_GNU_GETTEXT is expanded from...
aclocal.m4:488: AM_GLIB_GNU_GETTEXT is expanded from...
configure.ac:299: the top level
configure.ac:314: warning: The macro 'AC_HELP_STRING' is obsolete.
configure.ac:314: You should run autoupdate.
./lib/autoconf/general.m4:204: AC_HELP_STRING is expanded from...
m4/python.m4:83: LIBGPOD_CHECK_PYTHON is expanded from...
configure.ac:314: the top level
configure.ac:314: warning: The macro 'AC_TRY_CPP' is obsolete.
configure.ac:314: You should run autoupdate.
./lib/autoconf/general.m4:2762: AC_TRY_CPP is expanded from...
m4/python.m4:6: AM_CHECK_PYTHON_HEADERS is expanded from...
m4/python.m4:83: LIBGPOD_CHECK_PYTHON is expanded from...
configure.ac:314: the top level
configure.ac:314: warning: The macro 'AC_FD_CC' is obsolete.
configure.ac:314: You should run autoupdate.
./lib/autoconf/general.m4:399: AC_FD_CC is expanded from...
lib/m4sugar/m4sh.m4:690: _AS_IF_ELSE is expanded from...
lib/m4sugar/m4sh.m4:697: AS_IF is expanded from...
./lib/autoconf/general.m4:2249: AC_CACHE_VAL is expanded from...
m4/python.m4:32: AM_CHECK_PYMOD is expanded from...
m4/python.m4:83: LIBGPOD_CHECK_PYTHON is expanded from...
configure.ac:314: the top level
configure.ac:322: warning: The macro 'AC_HELP_STRING' is obsolete.
configure.ac:322: You should run autoupdate.
./lib/autoconf/general.m4:204: AC_HELP_STRING is expanded from...
m4/mono.m4:77: LIBGPOD_CHECK_MONO is expanded from...
configure.ac:322: the top level
autoreconf: running: /usr/bin/autoheader --force
autoreconf: running: automake --add-missing --copy --force-missing
configure.ac:24: installing './compile'
configure.ac:17: installing './missing'
bindings/mono/libgpod-sharp-test/../Makefile.include:1: warning: addprefix $(srcdir: non-POSIX variable name
bindings/mono/libgpod-sharp-test/../Makefile.include:1: (probably a GNU make extension)
bindings/mono/libgpod-sharp-test/Makefile.am:13: 'bindings/mono/libgpod-sharp-test/../Makefile.include' included from here
bindings/mono/libgpod-sharp-test/../Makefile.include:3: warning: strip $(patsubst library, dll, $(TARGET: non-POSIX variable name
bindings/mono/libgpod-sharp-test/../Makefile.include:3: (probably a GNU make extension)
bindings/mono/libgpod-sharp-test/Makefile.am:13: 'bindings/mono/libgpod-sharp-test/../Makefile.include' included from here
bindings/mono/libgpod-sharp-test/../Makefile.include:7: warning: firstword $(subst , $(DEFAULT_INSTALL_DIR: non-POSIX variable name
bindings/mono/libgpod-sharp-test/../Makefile.include:7: (probably a GNU make extension)
bindings/mono/libgpod-sharp-test/Makefile.am:13: 'bindings/mono/libgpod-sharp-test/../Makefile.include' included from here
bindings/mono/libgpod-sharp/Makefile.am:21: warning: ':='-style assignments are not portable
bindings/mono/libgpod-sharp/Makefile.am:21: warning: shell grep "^dlname=" $(top_builddir: non-POSIX variable name
bindings/mono/libgpod-sharp/Makefile.am:21: (probably a GNU make extension)
bindings/mono/libgpod-sharp/../Makefile.include:1: warning: addprefix $(srcdir: non-POSIX variable name
bindings/mono/libgpod-sharp/../Makefile.include:1: (probably a GNU make extension)
bindings/mono/libgpod-sharp/Makefile.am:31: 'bindings/mono/libgpod-sharp/../Makefile.include' included from here
bindings/mono/libgpod-sharp/../Makefile.include:3: warning: strip $(patsubst library, dll, $(TARGET: non-POSIX variable name
bindings/mono/libgpod-sharp/../Makefile.include:3: (probably a GNU make extension)
bindings/mono/libgpod-sharp/Makefile.am:31: 'bindings/mono/libgpod-sharp/../Makefile.include' included from here
bindings/mono/libgpod-sharp/../Makefile.include:7: warning: firstword $(subst , $(DEFAULT_INSTALL_DIR: non-POSIX variable name
bindings/mono/libgpod-sharp/../Makefile.include:7: (probably a GNU make extension)
bindings/mono/libgpod-sharp/Makefile.am:31: 'bindings/mono/libgpod-sharp/../Makefile.include' included from here
bindings/python/Makefile.am:36: warning: 'INCLUDES' is the old name for 'AM_CPPFLAGS' (or '*_CPPFLAGS')
bindings/python/Makefile.am: installing './depcomp'
docs/reference/Makefile.am:70: warning: 'INCLUDES' is the old name for 'AM_CPPFLAGS' (or '*_CPPFLAGS')
src/Makefile.am:55: warning: 'INCLUDES' is the old name for 'AM_CPPFLAGS' (or '*_CPPFLAGS')
tests/Makefile.am:56: warning: 'INCLUDES' is the old name for 'AM_CPPFLAGS' (or '*_CPPFLAGS')
tests/Makefile.am:43: warning: source file '$(top_srcdir)/src/itdb_plist.c' is in a subdirectory,
tests/Makefile.am:43: but option 'subdir-objects' is disabled
automake: warning: possible forward-incompatibility.
automake: At least one source file is in a subdirectory, but the 'subdir-objects'
automake: automake option hasn't been enabled. For now, the corresponding output
automake: object file(s) will be placed in the top-level directory. However, this
automake: behavior may change in a future Automake major version, with object
automake: files being placed in the same subdirectory as the corresponding sources.
automake: You are advised to start using 'subdir-objects' option throughout your
automake: project, to avoid future incompatibility.
tests/Makefile.am:43: warning: source file '$(top_srcdir)/src/itdb_sysinfo_extended_parser.c' is in a subdirectory,
tests/Makefile.am:43: but option 'subdir-objects' is disabled
tools/Makefile.am:24: warning: source file '$(top_srcdir)/src/itdb_sysinfo_extended_parser.c' is in a subdirectory,
tools/Makefile.am:24: but option 'subdir-objects' is disabled
tools/Makefile.am:24: warning: source file '$(top_srcdir)/src/itdb_plist.c' is in a subdirectory,
tools/Makefile.am:24: but option 'subdir-objects' is disabled
autoreconf: Leaving directory '.'
Package hal was not found in the pkg-config search path.
Perhaps you should add the directory containing `hal.pc'
to the PKG_CONFIG_PATH environment variable
No package 'hal' found
Package hal was not found in the pkg-config search path.
Perhaps you should add the directory containing `hal.pc'
to the PKG_CONFIG_PATH environment variable
No package 'hal' found
db-artwork-parser.c: In function ‘get_utf16_string’:
db-artwork-parser.c:90:9: warning: ‘g_memdup’ is deprecated: Use 'g_memdup2' instead [-Wdeprecated-declarations]
90 | tmp = g_memdup (buffer, length);
| ^~~
In file included from /usr/include/glib-2.0/glib/gstring.h:37,
from /usr/include/glib-2.0/glib/giochannel.h:36,
from /usr/include/glib-2.0/glib.h:56,
from itdb.h:44,
from db-artwork-parser.c:34:
/usr/include/glib-2.0/glib/gstrfuncs.h:338:23: note: declared here
338 | gpointer g_memdup (gconstpointer mem,
| ^~~~~~~~
itdb_artwork.c: In function ‘itdb_artwork_set_thumbnail_from_pixbuf’:
itdb_artwork.c:216:5: warning: ‘GTimeVal’ is deprecated: Use 'GDateTime' instead [-Wdeprecated-declarations]
216 | GTimeVal time;
| ^~~~~~~~
In file included from /usr/include/glib-2.0/glib/galloca.h:34,
from /usr/include/glib-2.0/glib.h:32,
from itdb.h:44,
from itdb_device.h:42,
from itdb_artwork.c:31:
/usr/include/glib-2.0/glib/gtypes.h:622:8: note: declared here
622 | struct _GTimeVal
| ^~~~~~~~~
itdb_artwork.c:223:5: warning: ‘g_get_current_time’ is deprecated: Use 'g_get_real_time' instead [-Wdeprecated-declarations]
223 | g_get_current_time (&time);
| ^~~~~~~~~~~~~~~~~~
In file included from /usr/include/glib-2.0/glib/giochannel.h:35,
from /usr/include/glib-2.0/glib.h:56:
/usr/include/glib-2.0/glib/gmain.h:830:8: note: declared here
830 | void g_get_current_time (GTimeVal *result);
| ^~~~~~~~~~~~~~~~~~
itdb_artwork.c: In function ‘itdb_artwork_set_thumbnail_from_data’:
itdb_artwork.c:278:5: warning: ‘GTimeVal’ is deprecated: Use 'GDateTime' instead [-Wdeprecated-declarations]
278 | GTimeVal time;
| ^~~~~~~~
/usr/include/glib-2.0/glib/gtypes.h:622:8: note: declared here
622 | struct _GTimeVal
| ^~~~~~~~~
itdb_artwork.c:283:5: warning: ‘g_get_current_time’ is deprecated: Use 'g_get_real_time' instead [-Wdeprecated-declarations]
283 | g_get_current_time (&time);
| ^~~~~~~~~~~~~~~~~~
/usr/include/glib-2.0/glib/gmain.h:830:8: note: declared here
830 | void g_get_current_time (GTimeVal *result);
| ^~~~~~~~~~~~~~~~~~
In file included from /usr/lib/glib-2.0/include/glibconfig.h:9,
from /usr/include/glib-2.0/glib/gtypes.h:34:
itdb_artwork.c: In function ‘unpack_rec_RGB_555’:
/usr/include/glib-2.0/glib/gmacros.h:1337:33: warning: Deprecated pre-processor symbol: replace with "memmove"
1337 | #define _GLIB_GNUC_DO_PRAGMA(x) _Pragma(G_STRINGIFY (x))
| ^~~~~~~
/usr/include/glib-2.0/glib/gmacros.h:1340:3: note: in expansion of macro ‘_GLIB_GNUC_DO_PRAGMA’
1340 | _GLIB_GNUC_DO_PRAGMA(GCC warning G_STRINGIFY (Deprecated pre-processor symbol: replace with #f))
| ^~~~~~~~~~~~~~~~~~~~
/usr/include/glib-2.0/glib/glib-visibility.h:278:46: note: in expansion of macro ‘GLIB_DEPRECATED_MACRO_FOR’
278 | #define GLIB_DEPRECATED_MACRO_IN_2_40_FOR(f) GLIB_DEPRECATED_MACRO_FOR (f)
| ^~~~~~~~~~~~~~~~~~~~~~~~~
/usr/include/glib-2.0/glib/gutils.h:315:64: note: in expansion of macro ‘GLIB_DEPRECATED_MACRO_IN_2_40_FOR’
315 | G_STMT_START { memmove ((dest), (src), (len)); } G_STMT_END GLIB_DEPRECATED_MACRO_IN_2_40_FOR(memmove)
| ^~~~~~~~~~~~~~~~~~~~~~~~~~~~~~~~~
itdb_artwork.c:445:13: note: in expansion of macro ‘g_memmove’
445 | g_memmove (use_pixels, pixels, bytes_len);
| ^~~~~~~~~
itdb_hashAB.c: In function ‘load_libhashab’:
itdb_hashAB.c:51:9: warning: ‘g_module_build_path’ is deprecated [-Wdeprecated-declarations]
51 | path = g_module_build_path(LIBGPOD_BLOB_DIR, "hashab");
| ^~~~
In file included from itdb_hashAB.c:34:
/usr/include/glib-2.0/gmodule.h:142:23: note: declared here
142 | gchar* g_module_build_path (const gchar *directory,
| ^~~~~~~~~~~~~~~~~~~
itdb_playlist.c: In function ‘itdb_playlist_duplicate’:
itdb_playlist.c:1212:5: warning: ‘g_memdup’ is deprecated: Use 'g_memdup2' instead [-Wdeprecated-declarations]
1212 | pl_dup->priv = g_memdup (pl->priv, sizeof (Itdb_Playlist_Private));
| ^~~~~~
In file included from /usr/include/glib-2.0/glib/gstring.h:37,
from /usr/include/glib-2.0/glib/giochannel.h:36,
from /usr/include/glib-2.0/glib.h:56,
from itdb.h:44,
from itdb_device.h:42,
from itdb_private.h:35,
from itdb_playlist.c:29:
/usr/include/glib-2.0/glib/gstrfuncs.h:338:23: note: declared here
338 | gpointer g_memdup (gconstpointer mem,
| ^~~~~~~~
itdb_itunesdb.c: In function ‘itdb_time_get_mac_time’:
itdb_itunesdb.c:8077:5: warning: ‘GTimeVal’ is deprecated: Use 'GDateTime' instead [-Wdeprecated-declarations]
8077 | GTimeVal time;
| ^~~~~~~~
In file included from /usr/include/glib-2.0/glib/galloca.h:34,
from /usr/include/glib-2.0/glib.h:32,
from itdb.h:44,
from db-artwork-parser.h:30,
from itdb_itunesdb.c:110:
/usr/include/glib-2.0/glib/gtypes.h:622:8: note: declared here
622 | struct _GTimeVal
| ^~~~~~~~~
itdb_itunesdb.c:8079:5: warning: ‘g_get_current_time’ is deprecated: Use 'g_get_real_time' instead [-Wdeprecated-declarations]
8079 | g_get_current_time (&time);
| ^~~~~~~~~~~~~~~~~~
In file included from /usr/include/glib-2.0/glib/giochannel.h:35,
from /usr/include/glib-2.0/glib.h:56:
/usr/include/glib-2.0/glib/gmain.h:830:8: note: declared here
830 | void g_get_current_time (GTimeVal *result);
| ^~~~~~~~~~~~~~~~~~
itdb_track.c: In function ‘itdb_track_duplicate’:
itdb_track.c:358:5: warning: ‘g_memdup’ is deprecated: Use 'g_memdup2' instead [-Wdeprecated-declarations]
358 | tr_dup->priv = g_memdup (tr->priv, sizeof (Itdb_Track_Private));
| ^~~~~~
In file included from /usr/include/glib-2.0/glib/gstring.h:37,
from /usr/include/glib-2.0/glib/giochannel.h:36,
from /usr/include/glib-2.0/glib.h:56,
from itdb.h:44,
from itdb_device.h:42,
from itdb_private.h:35,
from itdb_track.c:31:
/usr/include/glib-2.0/glib/gstrfuncs.h:338:23: note: declared here
338 | gpointer g_memdup (gconstpointer mem,
| ^~~~~~~~
itdb_thumb.c: In function ‘itdb_thumb_new_from_data’:
itdb_thumb.c:60:5: warning: ‘g_memdup’ is deprecated: Use 'g_memdup2' instead [-Wdeprecated-declarations]
60 | thumb_memory->image_data = g_memdup (data, len);
| ^~~~~~~~~~~~
In file included from /usr/include/glib-2.0/glib/gstring.h:37,
from /usr/include/glib-2.0/glib/giochannel.h:36,
from /usr/include/glib-2.0/glib.h:56,
from /usr/include/glib-2.0/glib/gi18n-lib.h:23,
from itdb_thumb.c:30:
/usr/include/glib-2.0/glib/gstrfuncs.h:338:23: note: declared here
338 | gpointer g_memdup (gconstpointer mem,
| ^~~~~~~~
ithumb-writer.c: In function ‘ithumb_writer_write_thumbnail’:
ithumb-writer.c:978:9: warning: ‘gdk_pixbuf_from_pixdata’ is deprecated [-Wdeprecated-declarations]
978 | pixbuf = gdk_pixbuf_from_pixdata (&questionmark_pixdata, FALSE, NULL);
| ^~~~~~
In file included from pixmaps.h:44,
from ithumb-writer.c:36:
/usr/include/gdk-pixbuf-2.0/gdk-pixbuf/gdk-pixdata.h:106:17: note: declared here
106 | GdkPixbuf* gdk_pixbuf_from_pixdata (const GdkPixdata *pixdata,
| ^~~~~~~~~~~~~~~~~~~~~~~
/usr/bin/ld: .libs/libgpod_la-itdb_sqlite.o: in function `itdb_sqlite_generate_itdbs':
/var/pisi/libgpod-0.8.3-7/work/libgpod-0.8.3/src/itdb_sqlite.c:2281:(.text+0x1372): warning: the use of `tmpnam' is dangerous, better use `mkstemp'
generic-callout.c: In function ‘get_info_from_usb’:
generic-callout.c:667:14: warning: old-style function definition [-Wold-style-definition]
667 | static char *get_info_from_usb (usb_bus_number, usb_device_number)
| ^~~~~~~~~~~~~~~~~
generic-callout.c:667:14: error: type of ‘usb_bus_number’ defaults to ‘int’ [-Wimplicit-int]
generic-callout.c:667:14: error: type of ‘usb_device_number’ defaults to ‘int’ [-Wimplicit-int]
make[2]: *** [Makefile:1060: ipod_set_info-generic-callout.o] Error 1
make[2]: *** Waiting for unfinished jobs....
make[1]: *** [Makefile:578: all-recursive] Error 1
make: *** [Makefile:487: all] Error 2
Traceback (most recent call last):
File "/var/pisi/libgpod/actions.py", line 28, in build
autotools.make()
File "/usr/lib/pisilinux/pisi/actionsapi/autotools.py", line 103, in make
if system('make %s %s' % (get.makeJOBS(), parameters)):
File "/usr/lib/pisilinux/pisi/actionsapi/shelltools.py", line 255, in system
error(_("Command \"%s\" failed, return value was %d.") % (command, retValue))
File "/usr/lib/pisilinux/pisi/actionsapi/__init__.py", line 27, in error
raise Error(msg)
pisi.actionsapi.Error: Command "make -j5" failed, return value was 2.
[01;31mAction script error caught.
[0m[01;33m*** 1 error(s), 0 warning(s)
[0m[01;31mProgram terminated.
[0m