warning: the compiler differs from the one used to build the kernel
  The kernel was built by: gcc (Pisi Linux) 15.2.0
  You are using:           x86_64-pc-linux-gnu-gcc (Pisi Linux) 15.2.0
In file included from nv-linux.h:14,
                 from nv.c:13:
nv.h:15:10: fatal error: nvtypes.h: No such file or directory
   15 | #include 
      |          ^~~~~~~~~~~
compilation terminated.
make[4]: *** [/usr/src/linux-headers-6.18.43/scripts/Makefile.build:287: nv.o] Error 1
make[4]: *** Waiting for unfinished jobs....
In file included from nv-linux.h:14,
                 from nv-acpi.c:15:
nv.h:15:10: fatal error: nvtypes.h: No such file or directory
   15 | #include 
      |          ^~~~~~~~~~~
compilation terminated.
make[4]: *** [/usr/src/linux-headers-6.18.43/scripts/Makefile.build:287: nv-acpi.o] Error 1
In file included from nv-linux.h:14,
                 from nv-chrdev.c:15:
nv.h:15:10: fatal error: nvtypes.h: No such file or directory
   15 | #include 
      |          ^~~~~~~~~~~
compilation terminated.
In file included from nv-linux.h:14,
                 from nv-cray.c:15:
nv.h:15:10: fatal error: nvtypes.h: No such file or directory
   15 | #include 
      |          ^~~~~~~~~~~
compilation terminated.
make[4]: *** [/usr/src/linux-headers-6.18.43/scripts/Makefile.build:287: nv-cray.o] Error 1
make[4]: *** [/usr/src/linux-headers-6.18.43/scripts/Makefile.build:287: nv-chrdev.o] Error 1
In file included from nv-linux.h:14,
                 from nv-dma.c:15:
nv.h:15:10: fatal error: nvtypes.h: No such file or directory
   15 | #include 
      |          ^~~~~~~~~~~
compilation terminated.
make[4]: *** [/usr/src/linux-headers-6.18.43/scripts/Makefile.build:287: nv-dma.o] Error 1
make[3]: *** [/usr/src/linux-headers-6.18.43/Makefile:2050: .] Error 2
make[2]: *** [/usr/src/linux-headers-6.18.43/Makefile:248: __sub-make] Error 2
make[1]: *** [Makefile:248: __sub-make] Error 2
make: *** [Makefile:202: nvidia.ko] Error 1
Traceback (most recent call last):
  File "/var/pisi/module-nvidia340/actions.py", line 83, in build
    autotools.make("module")
  File "/usr/lib/pisilinux/pisi/actionsapi/autotools.py", line 103, in make
    if system('make %s %s' % (get.makeJOBS(), parameters)):
  File "/usr/lib/pisilinux/pisi/actionsapi/shelltools.py", line 255, in system
    error(_("Command \"%s\" failed, return value was %d.") % (command, retValue))
  File "/usr/lib/pisilinux/pisi/actionsapi/__init__.py", line 27, in error
    raise Error(msg)
pisi.actionsapi.Error: Command "make -j5 module" failed, return value was 2.
Action script error caught.
*** 1 error(s), 0 warning(s)
Program terminated.