warning: the compiler differs from the one used to build the kernel
The kernel was built by: gcc (Pisi Linux) 15.2.0
You are using: x86_64-pc-linux-gnu-gcc (Pisi Linux) 15.2.0
nvidia/nv-instance.c:11:10: fatal error: nv-misc.h: No such file or directory
11 | #include "nv-misc.h"
| ^~~~~~~~~~~
compilation terminated.
nvidia/nv-frontend.c:11:10: fatal error: nv-misc.h: No such file or directory
11 | #include "nv-misc.h"
| ^~~~~~~~~~~
compilation terminated.
nvidia/nv-gpu-numa.c:24:10: fatal error: nv-linux.h: No such file or directory
24 | #include "nv-linux.h"
| ^~~~~~~~~~~~
compilation terminated.
nvidia/nv.c:11:10: fatal error: nv-misc.h: No such file or directory
11 | #include "nv-misc.h"
| ^~~~~~~~~~~
compilation terminated.
nvidia/nv-acpi.c:14:10: fatal error: nv-misc.h: No such file or directory
14 | #include "nv-misc.h"
| ^~~~~~~~~~~
compilation terminated.
make[4]: *** [/usr/src/linux-headers-6.18.43/scripts/Makefile.build:287: nvidia/nv-frontend.o] Error 1
make[4]: *** Waiting for unfinished jobs....
make[4]: *** [/usr/src/linux-headers-6.18.43/scripts/Makefile.build:287: nvidia/nv-instance.o] Error 1
make[4]: *** [/usr/src/linux-headers-6.18.43/scripts/Makefile.build:287: nvidia/nv-gpu-numa.o] Error 1
make[4]: *** [/usr/src/linux-headers-6.18.43/scripts/Makefile.build:287: nvidia/nv.o] Error 1
make[4]: *** [/usr/src/linux-headers-6.18.43/scripts/Makefile.build:287: nvidia/nv-acpi.o] Error 1
make[3]: *** [/usr/src/linux-headers-6.18.43/Makefile:2050: .] Error 2
make[2]: *** [/usr/src/linux-headers-6.18.43/Makefile:248: __sub-make] Error 2
make[1]: *** [Makefile:248: __sub-make] Error 2
make: *** [Makefile:81: modules] Error 2
Traceback (most recent call last):
File "/var/pisi/module-nvidia390/actions.py", line 80, in build
autotools.make("module")
File "/usr/lib/pisilinux/pisi/actionsapi/autotools.py", line 103, in make
if system('make %s %s' % (get.makeJOBS(), parameters)):
File "/usr/lib/pisilinux/pisi/actionsapi/shelltools.py", line 255, in system
error(_("Command \"%s\" failed, return value was %d.") % (command, retValue))
File "/usr/lib/pisilinux/pisi/actionsapi/__init__.py", line 27, in error
raise Error(msg)
pisi.actionsapi.Error: Command "make -j5 module" failed, return value was 2.
[01;31mAction script error caught.
[0m[01;33m*** 1 error(s), 0 warning(s)
[0m[01;31mProgram terminated.
[0m